{"text_format":"1","workbook":"xlsx","n_sheets":10,"sheets":["Ohje","Yhteenveto","Materiaaliluettelo","Valmistus, kuljetus, työmaa (A)","Käyttö (B)","Elinkaaren loppu (C+D)","Tietojen Laatu","Materiaalien päästötiedot","Datalehti","LOKI"],"not_rendered":{"charts":4,"images":10,"macros":1,"external_links":0,"defined_names":29,"comments":2,"pivot_tables":0},"unopened":[],"bounds":{"document_bytes":16777216,"sheet_cells":100000,"rows_first":2000,"rows_last":500,"rows_between":2000,"halvings":0,"cell_chars":16384,"cell_head_chars":4096},"cells_cut":0,"cells_raw":0,"read":"whole","date_system":"1900"}

{"sheet":"Ohje","index":0,"n_rows":21,"n_cols":2,"rows_kept":21,"cut":false,"hidden":false,"merged":[[1,1,1,2],[20,1,20,2],[6,1,6,2],[9,1,9,2],[15,1,15,2],[13,1,13,2]]}
[]
[null,"Rakennusten hiilijalanjäljen arviointityökalu"]
[null,"Luonnos hiilijalanjäljen arvioinnin testausta varten 9.12.2019"]
[]
[null,"Käyttöohje"]
[]
[null,"Tämä arviointityökalun luonnosversio on tarkoitettu rakennusten hiilijalanjäljen laskentamenetelmän testausta varten. Työkalua ja sen liitteenä olevia päästötietoja kehitetään testauksen jälkeen.\n\nAvoimen työkalun tarkoituksena on tukea ja edistää elinkaarilaskennan käyttöä rakennushankkeen valmistelussa, suunnittelussa, rakentamisessa ja rakennusten käytön aikana. Tämä työkalu on tarkoitettu rakennusten elinkaaren hiilijalanjäljen arviointiin ensisijaisesti silloin, kun käytetään ympäristöministeriön yksinkertaistettua arviointimenetelmää. Työkalua voidaan käyttää myös tarkennetulla arviointimenetelmällä tehtyjen laskelmien raportointiin. Arvioinnit voi tehdä myös muilla soveltuvilla työkaluilla. "]
[]
[null,"Työkalun sisältö"]
[null,"Työkalun eri välilehdillä kerätään tietoa hankkeesta ja sen elinkaarivaikutuksista seuraavasti:\nYhteenveto: Kohteen perustiedot ja arvioinnin tulokset\nMateriaaliluettelo: Rakennuksessa käytettyjen materiaalien luettelointi\nValmistu, kuljetus, työmaa (A): Valmistuksen, kuljetuksen ja rakentamisen päästöt\nKäyttö (B): Korjausten ja energiankulutuksen arviointi\nElinkaaren loppu (C+D):  Purkamisen ja jätteiden käsittelyn arviointi\nTietojen laatu: Käytetyn lähtötiedon luotettavuuden arviointi\nMateriaalitien päästötiedot: Työkalussa käytettävien hiilijalanjäljen ja -kädenjäljen kertoimet\n"]
[null,"Laskentatietojen syöttäminen "]
[]
[null,"Syötä tiedot harmaisiin soluihin"]
[null,"Työkaluun syötetään tietoja harmaalla pohjalla oleviin soluihin. Muut solut ovat lukittuja. "]
[null,"Valmiit taulukkoarvot sinisissä soluissa"]
[null,"Yksinkertaistetussa menetelmässä suurin osa laskennan tiedoista tulee pinta-alaan perustuvista taulukkoarvoista. Tällaiset kohdat työkalussa on esitetty vaaleansinisellä värillä, eikä niitä voi muokata."]
[null,"Tarkempia tietoja voi syöttää vihreisiin soluihin"]
[null,"Jos haluat korvata taulukkoarvoja tarkemmilla hankekohtaisilla tiedoilla, syötä nämä tiedot vihreisiin soluihin. Taulukkoarvon vieressä olevaa \"korvaa taulukkoarvot\" -nappia painamalla aukeaa uusi tietokenttä tätä varten. Vaalean vihreisiin soluihin syötetyt arvot korvaavat oletuksena olevat taulukkoarvot. Muista toimittaa liitteenä kirjallinen selvitys, mihin tietoihin tarkentavat laskelmasi perustuvat."]
[]
[null,"Käyttöoikeus ja vastuuvapaus"]
{"$rows_left_out":2}
{"sheet":"Yhteenveto","index":1,"n_rows":64,"n_cols":135,"rows_kept":64,"cut":false,"hidden":false,"merged":[[1,1,1,3],[31,1,31,2],[32,1,32,2],[36,1,36,2],[29,1,29,2],[6,1,6,4],[7,3,7,4],[9,3,9,4],[10,3,10,4],[11,3,11,4],[13,3,13,4],[17,3,17,4],[18,3,18,4],[7,1,10,1],[11,1,16,1],[8,3,8,4],[22,3,22,4],[12,3,12,4],[44,1,44,2],[22,1,22,2],[24,3,24,4],[26,3,26,4],[27,3,27,4],[14,3,14,4],[15,3,15,4],[16,3,16,4],[19,3,19,4],[20,3,20,4],[45,1,45,2],[46,1,46,2],[23,3,23,4],[42,1,42,2],[43,1,43,2],[34,1,34,2],[35,1,35,2],[25,3,25,4]]}
[]
[null,{"$f":"Ohje!B2","v":"Rakennusten hiilijalanjäljen arviointityökalu"}]
[null,{"$f":"Ohje!B3","v":"Luonnos hiilijalanjäljen arvioinnin testausta varten 9.12.2019"}]
[]
[null,"Yhteenveto"]
[]
[null,"Lähtötiedot"]
[null,"Rakennuskohteen tiedot","Kohteen nimi*"]
[null,null,"Rakennustunnus"]
[null,null,"Osoite"]
[null,null,"Rakennustyyppi"]
[null,"Rakennuksen tekniset tiedot","Kerrosala [kem2]"]
[null,null,"Lämmitetty nettoala [m2netto]*"]
[null,null,"Kerrosten lukumäärä"]
[null,null,"Kellarikerrosten lukumäärä"]
[null,null,"Pääasiallinen runkomateriaali"]
[null,null,"Energialuokka"]
[null,"Laskennan tiedot","Laskenta-ajanjakso*",50]
[null,null,"Arvioinnin tekovaihe"]
[null,null,"Käytetty arviointitapa"]
{"$rows_left_out":45}
{"sheet":"Materiaaliluettelo","index":2,"n_rows":51,"n_cols":17,"rows_kept":51,"cut":false,"hidden":false,"merged":[[5,12,5,13],[49,1,49,2],[5,1,5,8],[4,1,4,2]]}
[]
[null,{"$f":"Ohje!B2","v":"Rakennusten hiilijalanjäljen arviointityökalu"}]
[null,{"$f":"Ohje!B3","v":"Luonnos hiilijalanjäljen arvioinnin testausta varten 9.12.2019"}]
[]
[null,"Materiaaliluettelo"]
[null,"Syötä rakennuksen materiaalitiedot alla olevaan listaan esim. Määräluetteloon perustuen. Hiilijalanjäljen ja -kädenjäljen päästöt muodostuvat automaattisesti, kun määrät on syötetty. Lisää tarvittaessa rivejä kunkin otsakkeen alle 'Lisää rivi' -napilla. Jos tarkempi päästötieto jollekin tuotteelle tai materiaalille on olemassa, voit syöttää sen painamalla 'Korvaa taulukkoarvoja tarkemmilla tiedoille' -nappia.",null,null,null,null,null,null,null,"kgCO2e","kgCO2e",null,"\nTarkennetut kertoimet\nkgCO2e/yksikkö",null,"a","kpl","kgCO2e"]
[null,"Littera","Rakennusosa","Materiaalin tyyppi","Materiaali",null,"Määrä","yks",null,"Hiilijalanjälki","Hiilikädenjälki",null,"Hiilijalanjälki","Hiilikädenjälki","Vaihtoväli","Vaihdot","Hiilijalanjälki"]
[]
[]
[null,"Tontti (1.1. Alueosat)"]
[null,null,null,null,null,null,null,{"$f":"IF(E11=\"\",\"\",VLOOKUP(E11,'Materiaalien päästötiedot'!B:K,10,FALSE))","v":""},null,{"$f":"IF($E11=\"\",\"\",$G11*IF($M11=\"\",VLOOKUP($E11,'Materiaalien päästötiedot'!$B:$K,7,FALSE),$M11))","v":""},{"$f":"IF($E11=\"\",\"\",$G11*IF($N11=\"\",VLOOKUP($E11,'Materiaalien päästötiedot'!$B:$K,8,FALSE),$N11))","v":""},null,null,null,{"$f":"IF(E11=\"\",\"\",VLOOKUP(E11,'Materiaalien päästötiedot'!B:O,11,FALSE))","v":""},{"$f":"IF(E11=\"\",\"\",VLOOKUP(E11,'Materiaalien päästötiedot'!B:O,12,FALSE))","v":""},{"$f":"IF(E11=\"\",\"\",J11*P11)","v":""}]
[null,null,null,null,null,null,null,{"$f":"IF(E12=\"\",\"\",VLOOKUP(E12,'Materiaalien päästötiedot'!B:K,10,FALSE))","v":""},null,{"$f":"IF($E12=\"\",\"\",$G12*IF($M12=\"\",VLOOKUP($E12,'Materiaalien päästötiedot'!$B:$K,7,FALSE),$M12))","v":""},{"$f":"IF($E12=\"\",\"\",$G12*IF($N12=\"\",VLOOKUP($E12,'Materiaalien päästötiedot'!$B:$K,8,FALSE),$N12))","v":""},null,null,null,{"$f":"IF(E12=\"\",\"\",VLOOKUP(E12,'Materiaalien päästötiedot'!B:O,11,FALSE))","v":""},{"$f":"IF(E12=\"\",\"\",VLOOKUP(E12,'Materiaalien päästötiedot'!B:O,12,FALSE))","v":""},{"$f":"IF(E12=\"\",\"\",J12*P12)","v":""}]
[null,null,null,null,null,null,null,{"$f":"IF(E13=\"\",\"\",VLOOKUP(E13,'Materiaalien päästötiedot'!B:K,10,FALSE))","v":""},null,{"$f":"IF($E13=\"\",\"\",$G13*IF($M13=\"\",VLOOKUP($E13,'Materiaalien päästötiedot'!$B:$K,7,FALSE),$M13))","v":""},{"$f":"IF($E13=\"\",\"\",$G13*IF($N13=\"\",VLOOKUP($E13,'Materiaalien päästötiedot'!$B:$K,8,FALSE),$N13))","v":""},null,null,null,{"$f":"IF(E13=\"\",\"\",VLOOKUP(E13,'Materiaalien päästötiedot'!B:O,11,FALSE))","v":""},{"$f":"IF(E13=\"\",\"\",VLOOKUP(E13,'Materiaalien päästötiedot'!B:O,12,FALSE))","v":""},{"$f":"IF(E13=\"\",\"\",J13*P13)","v":""}]
[null,null,null,null,null,null,null,{"$f":"IF(E14=\"\",\"\",VLOOKUP(E14,'Materiaalien päästötiedot'!B:K,10,FALSE))","v":""},null,{"$f":"IF($E14=\"\",\"\",$G14*IF($M14=\"\",VLOOKUP($E14,'Materiaalien päästötiedot'!$B:$K,7,FALSE),$M14))","v":""},{"$f":"IF($E14=\"\",\"\",$G14*IF($N14=\"\",VLOOKUP($E14,'Materiaalien päästötiedot'!$B:$K,8,FALSE),$N14))","v":""},null,null,null,{"$f":"IF(E14=\"\",\"\",VLOOKUP(E14,'Materiaalien päästötiedot'!B:O,11,FALSE))","v":""},{"$f":"IF(E14=\"\",\"\",VLOOKUP(E14,'Materiaalien päästötiedot'!B:O,12,FALSE))","v":""},{"$f":"IF(E14=\"\",\"\",J14*P14)","v":""}]
[null,null,null,null,null,null,null,{"$f":"IF(E15=\"\",\"\",VLOOKUP(E15,'Materiaalien päästötiedot'!B:K,10,FALSE))","v":""},null,{"$f":"IF($E15=\"\",\"\",$G15*IF($M15=\"\",VLOOKUP($E15,'Materiaalien päästötiedot'!$B:$K,7,FALSE),$M15))","v":""},{"$f":"IF($E15=\"\",\"\",$G15*IF($N15=\"\",VLOOKUP($E15,'Materiaalien päästötiedot'!$B:$K,8,FALSE),$N15))","v":""},null,null,null,{"$f":"IF(E15=\"\",\"\",VLOOKUP(E15,'Materiaalien päästötiedot'!B:O,11,FALSE))","v":""},{"$f":"IF(E15=\"\",\"\",VLOOKUP(E15,'Materiaalien päästötiedot'!B:O,12,FALSE))","v":""},{"$f":"IF(E15=\"\",\"\",J15*P15)","v":""}]
[null,"Total",null,null,null,null,null,null,null,{"$f":"SUBTOTAL(109,Tontti[Column8])","v":0},{"$f":"SUBTOTAL(109,Tontti[Column9])","v":0},null,null,null,null,null,{"$f":"SUBTOTAL(109,Tontti[Column14])","v":0}]
[]
[null,"Kantavat rakenteet (1.2.1-1.2.3 Talo-osat)"]
[null,null,null,null,null,null,null,{"$f":"IF(E19=\"\",\"\",VLOOKUP(E19,'Materiaalien päästötiedot'!B:K,10,FALSE))","v":""},null,{"$f":"IF($E19=\"\",\"\",$G19*IF($M19=\"\",VLOOKUP($E19,'Materiaalien päästötiedot'!$B:$K,7,FALSE),$M19))","v":""},{"$f":"IF($E19=\"\",\"\",$G19*IF($N19=\"\",VLOOKUP($E19,'Materiaalien päästötiedot'!$B:$K,8,FALSE),$N19))","v":""},null,null,null,{"$f":"IF(E19=\"\",\"\",VLOOKUP(E19,'Materiaalien päästötiedot'!B:O,11,FALSE))","v":""},{"$f":"IF(E19=\"\",\"\",VLOOKUP(E19,'Materiaalien päästötiedot'!B:O,12,FALSE))","v":""},{"$f":"IF(E19=\"\",\"\",J19*P19)","v":""}]
[null,null,null,null,null,null,null,{"$f":"IF(E20=\"\",\"\",VLOOKUP(E20,'Materiaalien päästötiedot'!B:K,10,FALSE))","v":""},null,{"$f":"IF($E20=\"\",\"\",$G20*IF($M20=\"\",VLOOKUP($E20,'Materiaalien päästötiedot'!$B:$K,7,FALSE),$M20))","v":""},{"$f":"IF($E20=\"\",\"\",$G20*IF($N20=\"\",VLOOKUP($E20,'Materiaalien päästötiedot'!$B:$K,8,FALSE),$N20))","v":""},null,null,null,{"$f":"IF(E20=\"\",\"\",VLOOKUP(E20,'Materiaalien päästötiedot'!B:O,11,FALSE))","v":""},{"$f":"IF(E20=\"\",\"\",VLOOKUP(E20,'Materiaalien päästötiedot'!B:O,12,FALSE))","v":""},{"$f":"IF(E20=\"\",\"\",J20*P20)","v":""}]
{"$rows_left_out":32}
{"sheet":"Valmistus, kuljetus, työmaa (A)","index":3,"n_rows":27,"n_cols":4,"rows_kept":27,"cut":false,"hidden":false,"merged":[[15,1,15,3],[22,1,22,3],[26,1,26,3],[19,1,19,3]]}
[]
[null,{"$f":"Ohje!B2","v":"Rakennusten hiilijalanjäljen arviointityökalu"}]
[null,{"$f":"Ohje!B3","v":"Luonnos hiilijalanjäljen arvioinnin testausta varten 9.12.2019"}]
[null,"Valmistus, kuljetus ja työmaa -vaiheiden päästöjen arviointi (A)"]
[]
[null,null,"Hiilijalanjälki","Hiilikädenjälki"]
[null,null,"kg CO2e/m2netto/a","kg CO2e/m2netto/a"]
[null,"Ennen käyttöä syntyvät päästöt yhteensä",{"$f":"C10+C22","v":0.54600000000000004},{"$f":"D10+D22","v":0}]
[]
[null,"Valmistus ja kuljetusvaihe (A1-4)",{"$f":"IFERROR(IF(C18=\"\",SUM(C11:C15),C18),\"-\")","v":0},{"$f":"IFERROR(IF(D18=\"\",SUM(D11:D15),D18),\"-\")","v":0}]
[null,"Tontti",{"$f":"IFERROR(Tontti[[#Totals],[Column8]]/Yhteenveto!$D$13/Yhteenveto!$D$18,\"-\")","v":"-"},{"$f":"IFERROR(Tontti[[#Totals],[Column9]]/Yhteenveto!$D$13/Yhteenveto!$D$18,\"-\")","v":"-"}]
[null,"Kantavat rakenteet",{"$f":"IFERROR(Kantavat[[#Totals],[Column8]]/Yhteenveto!$D$13/Yhteenveto!$D$18,\"-\")","v":"-"},{"$f":"IFERROR(Kantavat[[#Totals],[Column9]]/Yhteenveto!$D$13/Yhteenveto!$D$18,\"-\")","v":"-"}]
[null,"Vaippa",{"$f":"IFERROR(Vaippa[[#Totals],[Column8]]/Yhteenveto!$D$13/Yhteenveto!$D$18,\"-\")","v":"-"},{"$f":"IFERROR(Vaippa[[#Totals],[Column9]]/Yhteenveto!$D$13/Yhteenveto!$D$18,\"-\")","v":"-"}]
[null,"Kevyet rakenteet",{"$f":"IFERROR(Kevyet[[#Totals],[Column8]]/Yhteenveto!$D$13/Yhteenveto!$D$18,\"-\")","v":"-"},{"$f":"IFERROR(Kevyet[[#Totals],[Column9]]/Yhteenveto!$D$13/Yhteenveto!$D$18,\"-\")","v":"-"}]
[null,"Talotekniikka",{"$f":"IFERROR(TATE[[#Totals],[Column8]]/Yhteenveto!$D$13/Yhteenveto!$D$18,\"-\")","v":"-"},{"$f":"IFERROR(TATE[[#Totals],[Column9]]/Yhteenveto!$D$13/Yhteenveto!$D$18,\"-\")","v":"-"}]
[null,"Valmistusvaiheen päästöjen tulokset muodostuvat automaattisesti välilehdellä 'Materiaaliluettelo' annettujen arvojen perusteella."]
[]
[null,"Valmistus ja kuljetusvaihe (A1-4) tarkennettu laskenta"]
[]
[null,"Selitä tähän kenttään miten ja mistä tarkemmat arvot on saatu. Esitä tarvittaessa erilliset laskelmat liitteenä. Tarkempia laskelmia käytettäessä älä syötä mitään lukuja ylempään taulukkoon tai Materiaalit - välilehdelle."]
{"$rows_left_out":8}
{"sheet":"Käyttö (B)","index":4,"n_rows":33,"n_cols":5,"rows_kept":33,"cut":false,"hidden":false,"merged":[[25,1,25,2],[28,1,28,4],[32,1,32,4],[23,1,23,4],[4,1,4,2],[20,1,20,4],[19,1,19,4]]}
[]
[null,{"$f":"Ohje!B2","v":"Rakennusten hiilijalanjäljen arviointityökalu"}]
[null,{"$f":"Ohje!B3","v":"Luonnos hiilijalanjäljen arvioinnin testausta varten 9.12.2019"}]
[]
[null,"Käyttövaiheen päästöjen arviointi (B)"]
[]
[null,null,null,"Hiilijalanjälki","Hiilikädenjälki"]
[null,null,null,"kg CO2e/m2netto/a","kg CO2e/m2netto/a"]
[null,"Käytön aikana syntyvät päästöt yhteensä",null,{"$f":"IFERROR(D11+D26,\"-\")","v":4.3200000000000002E-2},{"$f":"E11","v":0}]
[]
[null,"Energiankäyttö (B6)","Energiankulutus (kWh/m2netto/a)",{"$f":"IF(D22=\"\",SUM(D12:D15),D22)","v":0},{"$f":"IF(E22=\"\",SUM(E12:E15),E22)","v":0}]
[null,"Sähkö",null,{"$f":"IFERROR(C12*Datalehti!T14,\"-\")","v":0},"-"]
[null,"Kaukolämpö",null,{"$f":"IFERROR(C13*Datalehti!T15,\"-\")","v":0},"-"]
[null,"Fossiiliset polttoaineet",null,{"$f":"IFERROR(C14*Datalehti!T16,\"-\")","v":0},"-"]
[null,"Uusiutuvat polttoaineet",null,{"$f":"IFERROR(C15*Datalehti!T17,\"-\")","v":0},{"$f":"IFERROR(-Datalehti!D46,\"-\")","v":0}]
[]
[null,"Ylijäämäenergia","Energian tuotanto (kWh/m2netto/a)"]
[null,"Sähkö",null,"Verkkoon syötetty uusiutuvilla polttoaineilla tuotettu sähkö"]
[null,"Lämpö",null,"Verkkoon syötetty uusiutuvilla polttoaineilla tuotettu lämpö"]
[null,"Syötä yllä olevaan listaan rakennuksen laskennallinen vuotuinen ostoenergian kulutus energiaselvityksen tai vastaavan laskelman pohjalta. Enerigiankäytön päästöt muodostuvat automaattisesti eri energiamuotojen päästötietojen perusteella, kun kulutus on syötetty. Energiamuotojen päästökertoimia ei voi muuttaa. \nVerkkoon syötetty, tontilla tuotettu, uusiutuva energia huomioidaan kiinteistön hiilikädenjäljessä. Syötä vuotuinen ylijäämäenergia erikseen yllä oleviin kenttiin."]
{"$rows_left_out":14}
{"sheet":"Elinkaaren loppu (C+D)","index":5,"n_rows":33,"n_cols":5,"rows_kept":33,"cut":false,"hidden":false,"merged":[[10,1,10,2],[16,1,16,2],[14,1,14,4],[17,1,17,4],[11,1,11,4],[20,1,20,4],[26,1,26,4],[32,1,32,4],[23,1,23,4],[28,1,28,2],[29,1,29,4]]}
[]
[null,{"$f":"Ohje!B2","v":"Rakennusten hiilijalanjäljen arviointityökalu"}]
[null,{"$f":"Ohje!B3","v":"Luonnos hiilijalanjäljen arvioinnin testausta varten 9.12.2019"}]
[]
[null,"Elinkaaren lopun päästötiedot"]
[]
[null,null,null,"Hiilijalanjälki","Hiilikädenjälki"]
[null,null,null,"kg CO2e/m2netto/a","kg CO2e/m2netto/a"]
[null,"Elinkaaren lopussa syntyvät päästöt yhteensä",null,{"$f":"D23+D17+D11+D29","v":0.67200000000000004},{"$f":"E23+E17+E11+E29","v":0}]
[]
[null,"Purkaminen (C1)",null,{"$f":"IF(D13=\"\",Datalehti!C38/Yhteenveto!$D18,D13)","v":0.156},{"$f":"IF(E13=\"\",Datalehti!D38/Yhteenveto!$D18,E13)","v":0}]
[null,"Päästötiedot pohjautuvat taulukkoarvoihin."]
[null,"Purkaminen (C1) tarkennettu laskenta"]
[]
[null,"Selitä tähän kenttään miten ja mistä tarkemmat arvot on saatu. Esitä tarvittaessa erilliset laskelmat liitteenä."]
[]
[null,"Kuljetukset (C2)",null,{"$f":"IF(D19=\"\",Datalehti!C39/Yhteenveto!$D18,D19)","v":0.20399999999999999},{"$f":"IF(E19=\"\",Datalehti!D39/Yhteenveto!$D18,E19)","v":0}]
[null,"Päästötiedot pohjautuvat taulukkoarvoihin."]
[null,"Kuljetukset (C2) tarkennettu laskenta"]
[]
{"$rows_left_out":14}
{"sheet":"Tietojen Laatu","index":6,"n_rows":31,"n_cols":8,"rows_kept":31,"cut":false,"hidden":false,"merged":[[31,1,31,7],[4,1,4,2],[23,5,23,6],[24,5,24,6],[25,5,25,6],[26,5,26,6],[7,1,7,7],[27,5,27,6],[23,3,23,4],[24,3,24,4],[25,3,25,4],[26,3,26,4],[27,3,27,4]]}
[]
[null,{"$f":"Ohje!B2","v":"Rakennusten hiilijalanjäljen arviointityökalu"}]
[null,{"$f":"Ohje!B3","v":"Luonnos hiilijalanjäljen arvioinnin testausta varten 9.12.2019"}]
[]
[null,"Tietojen Laatu"]
[]
[null,"Tietojen laatu"]
[null,"Arvioinnissa käytettävien tietojen laatu tulee arvioida, jos arviointi tehdään käyttäen ns. tarkennettua menetelmää. Yksinkertaistettua menetelmää käytettäessä tätä välilehteä ei tarvitse täyttää. \nAlla ehdotettu lähtötietojen arviointitapa perustuu Euroopan komission Level(s)-menetelmään."]
[null,"Elinkaaren vaiheet","Teknologinen edustavuus","Maan-tieteellinen edustavuus","Ajallinen edustavuus","Epävarmuus","Yhteensä","Vähimmäisvaatimukset"]
[]
[null,"A1–3 Tuotteiden valmistus",null,null,null,null,{"$f":"(SUM(C11:F11))","v":0},"Tiedot vähintään tasoa 2"]
[null,"A4 Kuljetus työmaalle",null,null,null,null,{"$f":"IFERROR(SUM(C12:F12),\"\")","v":0},"Maantieteellinen edustavuus oltava tasoa 3"]
[null,"A5 Työmaan toiminnot",null,null,null,null,0,"Maantieteellinen edustavuus vähintään tasoa 2"]
[null,"B3–4 Korjaukset ja vaihdot",null,null,null,null,0,"Maantieteellinen edustavuus vähintään tasoa 2"]
[null,"B6 Energian kulutus",null,null,null,null,0,"Tiedot vähintään tasoa 2"]
[null,"C1 Purkutyöt",null,null,null,null,0,"Ei vähimmäisvaatimuksia"]
[null,"C2 Kuljetus jatkokäsittelyyn",null,null,null,null,0,"Ei vähimmäisvaatimuksia"]
[null,"C3 Jätteenkäsittely",null,null,null,null,0,"Ei vähimmäisvaatimuksia"]
[null,"C4 Loppusijoitus",null,null,null,null,0,"Ei vähimmäisvaatimuksia"]
[null,"D Elinkaaren ulkopuoliset",null,null,null,null,0,"Ei vähimmäisvaatimuksia"]
{"$rows_left_out":12}
{"sheet":"Materiaalien päästötiedot","index":7,"n_rows":226,"n_cols":15,"rows_kept":226,"cut":false,"hidden":false,"merged":[[5,1,5,11]]}
[]
[null,{"$f":"Ohje!B2","v":"Rakennusten hiilijalanjäljen arviointityökalu"}]
[null,{"$f":"Ohje!B3","v":"Luonnos hiilijalanjäljen arvioinnin testausta varten 9.12.2019"}]
[]
[null,"Materiaalien päästötiedot"]
[null,"© VTT 2018. Testausvaiheen geneerinen päästötaulukko perustuu VTT:n eri lähteistä kokoamiin ja arvioimiin tuloksiin. Arvot on koottu siten, että ne kattavat elinkaaren vaiheet A1 - A5 (vaiheessa A5 vain arvioidun hukan osalta). Taulukkoa on viime vaiheessa päivitetty muutamilla hyvin karkeasti arvioiduilla tarkistamattomilla arvoilla. VTT:llä on yksinomainen omistus- ja tekijänoikeus kokonaistaulukkoon. Taulukkoa saa käyttää testaamiseen eikä sitä saa muuttaa, käyttää eikä luovuttaa käytettäväksi muuhun tarkoitukseen ilman VTT:n nimenomaista suostumusta. \nTaulukko on tarkoitettu vain menetelmän testausvaiheeseen eikä VTT ota vastuuta siihen sisältyvien tietojen oikeellisuudesta.",null,null,null,null,null,null,null,null,null,null,null,"Vaihdot"]
[null,"Materiaalit","CO2e","Hiilisisältö","CO2e","CO2e","CO2e","Hiilijalanjälki","Hiilikädenjälki","Yksikkö","yksikkö materiaalin määrälle","Vaihtoväli (a)","Asennuskerran elinkaaren aikana (mukaanlukien ensimmäinen)","Hiilijalanjälki","Hiilikädenjälki"]
[null,null,"kg/kg","kg CO2/kg","kg/m2","kg/kpl","kg/kerros-m2"]
[]
[null,"PAIKALLAVALUBETONI JA RAUDOITTEET"]
[null,"Betoniteräs",0.47399999999999998,null,null,null,null,{"$f":"IF(E11=\"\",IF(C11=\"\",\"\",C11),E11)","v":0.47399999999999998},{"$f":"IF(H11=\"\",\"\",D11*-1)","v":0},{"$f":"IF(H11=\"\",\"\",(IF(E11=\"\",\"kgCO2e/kg\",\"kgCO2e/m2\")))","v":"kgCO2e/kg"},{"$f":"IF(H11=\"\",\"\",(IF(E11=\"\",\"kg\",\"m2\")))","v":"kg"},"Ei vaihdeta",{"$f":"IFERROR(QUOTIENT(Yhteenveto!$D$18-1,L11),0)","v":0},{"$f":"M11*H11","v":0},{"$f":"M11*I11","v":0}]
[null,"Valmisbetoni C35 (portland)",0.1458347961,null,null,null,null,{"$f":"IF(E12=\"\",IF(C12=\"\",\"\",C12),E12)","v":0.1458347961},{"$f":"IF(H12=\"\",\"\",D12*-1)","v":0},{"$f":"IF(H12=\"\",\"\",(IF(E12=\"\",\"kgCO2e/kg\",\"kgCO2e/m2\")))","v":"kgCO2e/kg"},{"$f":"IF(H12=\"\",\"\",(IF(E12=\"\",\"kg\",\"m2\")))","v":"kg"},"Ei vaihdeta",{"$f":"IFERROR(QUOTIENT(Yhteenveto!$D$18-1,L12),0)","v":0},{"$f":"M12*H12","v":0},{"$f":"M12*I12","v":0}]
[null,"Valmisbetoni C35 (seossementti)",0.127,null,null,null,null,{"$f":"IF(E13=\"\",IF(C13=\"\",\"\",C13),E13)","v":0.127},{"$f":"IF(H13=\"\",\"\",D13*-1)","v":0},{"$f":"IF(H13=\"\",\"\",(IF(E13=\"\",\"kgCO2e/kg\",\"kgCO2e/m2\")))","v":"kgCO2e/kg"},{"$f":"IF(H13=\"\",\"\",(IF(E13=\"\",\"kg\",\"m2\")))","v":"kg"},"Ei vaihdeta",{"$f":"IFERROR(QUOTIENT(Yhteenveto!$D$18-1,L13),0)","v":0},0,0]
[null,"Valmisbetoni C50 (portland)",0.17499999999999999,null,null,null,null,{"$f":"IF(E14=\"\",IF(C14=\"\",\"\",C14),E14)","v":0.17499999999999999},{"$f":"IF(H14=\"\",\"\",D14*-1)","v":0},{"$f":"IF(H14=\"\",\"\",(IF(E14=\"\",\"kgCO2e/kg\",\"kgCO2e/m2\")))","v":"kgCO2e/kg"},{"$f":"IF(H14=\"\",\"\",(IF(E14=\"\",\"kg\",\"m2\")))","v":"kg"},"Ei vaihdeta",{"$f":"IFERROR(QUOTIENT(Yhteenveto!$D$18-1,L14),0)","v":0},0,0]
[null,"Valmisbetoni C80 (Portland)",0.20953199609999998,null,null,null,null,{"$f":"IF(E15=\"\",IF(C15=\"\",\"\",C15),E15)","v":0.20953199609999998},{"$f":"IF(H15=\"\",\"\",D15*-1)","v":0},{"$f":"IF(H15=\"\",\"\",(IF(E15=\"\",\"kgCO2e/kg\",\"kgCO2e/m2\")))","v":"kgCO2e/kg"},{"$f":"IF(H15=\"\",\"\",(IF(E15=\"\",\"kg\",\"m2\")))","v":"kg"},"Ei vaihdeta",{"$f":"IFERROR(QUOTIENT(Yhteenveto!$D$18-1,L15),0)","v":0},0,0]
[null,null,null,null,null,null,null,{"$f":"IF(E16=\"\",IF(C16=\"\",\"\",C16),E16)","v":""},{"$f":"IF(H16=\"\",\"\",D16*-1)","v":""},{"$f":"IF(H16=\"\",\"\",(IF(E16=\"\",\"kgCO2e/kg\",\"kgCO2e/m2\")))","v":""},{"$f":"IF(H16=\"\",\"\",(IF(E16=\"\",\"kg\",\"m2\")))","v":""},null,{"$f":"IFERROR(QUOTIENT(Yhteenveto!$D$18-1,L16),0)","v":0},{"$error":"#VALUE!"},{"$error":"#VALUE!"}]
[null,"PIHA JA POHJARAKENTEET",null,null,null,null,null,{"$f":"IF(E17=\"\",IF(C17=\"\",\"\",C17),E17)","v":""},{"$f":"IF(H17=\"\",\"\",D17*-1)","v":""},{"$f":"IF(H17=\"\",\"\",(IF(E17=\"\",\"CO2e/kg\",\"CO2e/m2\")))","v":""},{"$f":"IF(H17=\"\",\"\",(IF(E17=\"\",\"kg\",\"m2\")))","v":""},null,{"$f":"IFERROR(QUOTIENT(Yhteenveto!$D$18-1,L17),0)","v":0},{"$error":"#VALUE!"},{"$error":"#VALUE!"}]
[null,"Betoniantura ja -perustus (sis.raudoitteet)",0.16,null,null,null,null,{"$f":"IF(E18=\"\",IF(C18=\"\",\"\",C18),E18)","v":0.16},{"$f":"IF(H18=\"\",\"\",D18*-1)","v":0},{"$f":"IF(H18=\"\",\"\",(IF(E18=\"\",\"kgCO2e/kg\",\"kgCO2e/m2\")))","v":"kgCO2e/kg"},{"$f":"IF(H18=\"\",\"\",(IF(E18=\"\",\"kg\",\"m2\")))","v":"kg"},"Ei vaihdeta",{"$f":"IFERROR(QUOTIENT(Yhteenveto!$D$18-1,L18),0)","v":0},0,0]
[null,"EPDM-matto (synteettinen kumi)",2.694,null,null,null,null,2.694,0,"kgCO2e/kg","kg",30,{"$f":"IFERROR(QUOTIENT(Yhteenveto!$D$18-1,L19),0)","v":1},2.694,0]
[null,"Kevytsora",0.45931159999999999,null,null,null,null,0.45931159999999999,0,"kgCO2e/kg",{"$f":"IF(H20=\"\",\"\",(IF(E20=\"\",\"kg\",\"m2\")))","v":"kg"},"Ei vaihdeta",{"$f":"IFERROR(QUOTIENT(Yhteenveto!$D$18-1,L20),0)","v":0},0,0]
{"$rows_left_out":207}
{"sheet":"Datalehti","index":8,"n_rows":101,"n_cols":139,"rows_kept":101,"cut":false,"hidden":true,"merged":[]}
[]
[]
[null,"Laskennalliset päästöt","päivitetty 6/2019",null,"huom 2120 jälkeen vakio ja 2010 luvut on vanhoja"]
[null," (kgCO2e /kWh)"]
[null,"Energiamuoto",2010,2020,2030,2040,2050,2060,2070,2080,2090,2100,2110,2120,2130,2140,2150]
[null,"Sähkö",0.158,0.121,5.7000000000000002E-2,0.03,1.7999999999999999E-2,1.4E-2,7.0000000000000001E-3,4.0000000000000001E-3,2E-3,1E-3,1E-3,0,{"$f":"N6","v":0},{"$f":"O6","v":0},0]
[null,"Kaukolämpö",0.16400000000000001,0.13,9.2999999999999999E-2,6.3E-2,3.6999999999999998E-2,3.3000000000000002E-2,2.1999999999999999E-2,1.4999999999999999E-2,0.01,7.0000000000000001E-3,4.0000000000000001E-3,3.0000000000000001E-3,{"$f":"N7","v":3.0000000000000001E-3},{"$f":"O7","v":3.0000000000000001E-3},3.0000000000000001E-3]
[null,"Fossiiliset ",0.26,0.26,0.26,0.26,0.26,0.26,0.26,0.26,0.26,0.26,0.26,0.26,0.26,0.26,0.26]
[null,"Uusiutuvat ",0,0,0,0,0,0,0,0,0,0,0,0,0,0,0]
[]
[null,"Laskennan vuodet (a)",{"$f":"IF(C13>$E20,IF(C13<$E22,10,IF(C13<$E22+1,$E23,0)),(IF(C13>$E20-1,10-$E21,0)))","v":0},0,0,0,0,0,0,0,0,0,0,0,0,0,0]
[null," (akgCO2e /kWh)",null,null,null,null,null,null,null,null,null,null,null,null,null,null,null,null,"Päästökertoimet","Päästökertoimet"]
[null,"Energiamuoto",2010,2020,2030,2040,2050,2060,2070,2080,2090,2100,2110,2120,2130,2140,2150,null," (akgCO2e /kWh)"," (kgCO2e /kWh)"]
[null,"Sähkö",{"$f":"C$11*C6","v":0},{"$f":"D$11*D6","v":0},0,0,0,0,0,0,0,0,0,0,0,0,0,null,{"$f":"SUM(C14:Q14)","v":0},{"$f":"S14/C$22","v":0}]
[null,"Kaukolämpö",{"$f":"C$11*C7","v":0},{"$f":"D$11*D7","v":0},0,0,0,0,0,0,0,0,0,0,0,0,0,null,{"$f":"SUM(C15:Q15)","v":0},{"$f":"S15/C$22","v":0}]
[null,"Fossiiliset ",{"$f":"C$11*C8","v":0},{"$f":"D$11*D8","v":0},0,0,0,0,0,0,0,0,0,0,0,0,0,null,0,0]
[null,"Uusiutuvat ",{"$f":"C$11*C9","v":0},{"$f":"D$11*D9","v":0},0,0,0,0,0,0,0,0,0,0,0,0,0,null,0,0]
[]
[]
[null,null,null,null,{"$f":"INT(LEFT(C21,3)&\"0\")","v":0}]
{"$rows_left_out":82}
{"sheet":"LOKI","index":9,"n_rows":2,"n_cols":2,"rows_kept":2,"cut":false,"hidden":true,"merged":[]}
["Tehdyt päivitykset"]
["2019-12-09","Korjattu materiaaliluettelon toimimattomat alasvetovalikot ja lämmöneristeiden päästötietoja VTT:n ohjeiden mukaan"]